Reaction Details
TargetDNA dC->dU-editing enzyme APOBEC-3G
LigandBDBM80165
Substrate/Competitorn/a
Meas. Tech.Dose Response confirmation of small molecule APOBEC3G DNA Deaminase Inhibitors via a fluorescence-based single-stranded DNA deaminase assay
Temperature298.15±n/a K
IC50 2480±n/a nM
Commentsextracted
Citation PubChem, PC Dose Response confirmation of small molecule APOBEC3G DNA Deaminase Inhibitors via a fluorescence-based single-stranded DNA deaminase assay PubChem Bioassay(2011)[AID]
 
DNA dC->dU-editing enzyme APOBEC-3G
Name:DNA dC->dU-editing enzyme APOBEC-3G
Type:Enzyme Catalytic Domain
Mol. Mass.:46419.54
Organism:Homo sapiens (Human)
Description:gi_13399304
Residue:384
BDBM80165
NameBDBM80165
Synonyms:(6E)-2-methoxy-6-[[[3-(1,4,5,6-tetrahydrocyclopenta[c]pyrazol-3-yl)-5-thioxo-1H-1,2,4-triazol-4-yl]amino]methylene]cyclohexa-2,4-dien-1-one (6E)-2-methoxy-6-[[[5-sulfanylidene-3-(1,4,5,6-tetrahydrocyclopenta[c]pyrazol-3-yl)-1H-1,2,4-triazol-4-yl]amino]methylidene]cyclohexa-2,4-dien-1-one MLS000331418 cid_6415306
TypeSmall organic molecule
Emp. Form.C16H16N6O2S
Mol. Mass.356.402
SMILESCOc1cccc(C=Nn2c(n[nH]c2=S)-c2n[nH]c3CCCc23)c1O