Reaction Details
TargetDNA dC->dU-editing enzyme APOBEC-3G
LigandBDBM80304
Substrate/Competitorn/a
Meas. Tech.Dose Response confirmation of small molecule APOBEC3G DNA Deaminase Inhibitors via a fluorescence-based single-stranded DNA deaminase assay
Temperature298.15±n/a K
IC50 2420±n/a nM
Commentsextracted
Citation PubChem, PC Dose Response confirmation of small molecule APOBEC3G DNA Deaminase Inhibitors via a fluorescence-based single-stranded DNA deaminase assay PubChem Bioassay(2011)[AID]
 
DNA dC->dU-editing enzyme APOBEC-3G
Name:DNA dC->dU-editing enzyme APOBEC-3G
Type:Enzyme Catalytic Domain
Mol. Mass.:46419.54
Organism:Homo sapiens (Human)
Description:gi_13399304
Residue:384
BDBM80304
NameBDBM80304
Synonyms:(1Z)-1-[[(3-methyl-5-sulfanylidene-1H-1,2,4-triazol-4-yl)amino]methylidene]-2-naphthalenone (1Z)-1-[[(3-methyl-5-thioxo-1H-1,2,4-triazol-4-yl)amino]methylene]naphthalen-2-one MLS001163612 cid_5398581
TypeSmall organic molecule
Emp. Form.C14H12N4OS
Mol. Mass.284.336
SMILESCc1n[nH]c(=S)n1N=Cc1c(O)ccc2ccccc12