Reaction Details
TargetDNA dC->dU-editing enzyme APOBEC-3G
LigandBDBM59063
Substrate/Competitorn/a
Meas. Tech.Dose Response confirmation of small molecule APOBEC3G DNA Deaminase Inhibitors via a fluorescence-based single-stranded DNA deaminase assay
Temperature298.15±n/a K
IC50 1700±n/a nM
Commentsextracted
Citation PubChem, PC Dose Response confirmation of small molecule APOBEC3G DNA Deaminase Inhibitors via a fluorescence-based single-stranded DNA deaminase assay PubChem Bioassay(2011)[AID]
 
DNA dC->dU-editing enzyme APOBEC-3G
Name:DNA dC->dU-editing enzyme APOBEC-3G
Type:Enzyme Catalytic Domain
Mol. Mass.:46419.54
Organism:Homo sapiens (Human)
Description:gi_13399304
Residue:384
BDBM59063
NameBDBM59063
Synonyms:4-butyl-1-sulfanylidene-2H-[1,2,4]triazolo[4,3-a]quinazolin-5-one MLS001172798 US20230365568, Compound 23 | cid_2120114
TypeSmall organic molecule
Emp. Form.C13H14N4OS
Mol. Mass.274.341
SMILESCCCCn1c2n[nH]c(=S)n2c2ccccc2c1=O