Reaction Details
TargetDNA dC->dU-editing enzyme APOBEC-3G
LigandBDBM80433
Substrate/Competitorn/a
Meas. Tech.Dose Response confirmation of APOBEC3A DNA Deaminase Inhibitors via a A3G counterscreen
Temperature298.15±n/a K
IC50 1310±101 nM
Commentsextracted
Citation PubChem, PC Dose Response confirmation of APOBEC3A DNA Deaminase Inhibitors via a A3G counterscreen PubChem Bioassay(2011)[AID]
 
DNA dC->dU-editing enzyme APOBEC-3G
Name:DNA dC->dU-editing enzyme APOBEC-3G
Type:Enzyme Catalytic Domain
Mol. Mass.:46419.54
Organism:Homo sapiens (Human)
Description:gi_13399304
Residue:384
BDBM80433
NameBDBM80433
Synonyms:(1,3-dimethyl-1H-imidazol-3-ium-2-yl)methyl methylcarbamate MLS000700479 N-methylcarbamic acid (1,3-dimethylimidazol-1-ium-2-yl)methyl ester;iodide cid_15945653
TypeSmall organic molecule
Emp. Form.C8H14N3O2
Mol. Mass.184.2151
SMILESCNC(=O)OCc1n(C)cc[n+]1C