Reaction Details
TargetDNA dC->dU-editing enzyme APOBEC-3G
LigandBDBM80505
Substrate/Competitorn/a
Meas. Tech.Dose Response confirmation of APOBEC3A DNA Deaminase Inhibitors via a A3G counterscreen
Temperature298.15±n/a K
IC50 1750±381 nM
Commentsextracted
Citation PubChem, PC Dose Response confirmation of APOBEC3A DNA Deaminase Inhibitors via a A3G counterscreen PubChem Bioassay(2011)[AID]
 
DNA dC->dU-editing enzyme APOBEC-3G
Name:DNA dC->dU-editing enzyme APOBEC-3G
Type:Enzyme Catalytic Domain
Mol. Mass.:46419.54
Organism:Homo sapiens (Human)
Description:gi_13399304
Residue:384
BDBM80505
NameBDBM80505
Synonyms:(8,8-dimethyl-8-azoniabicyclo[3.2.1]octan-3-yl) benzoate;bromide MLS000766744 benzoic acid (8,8-dimethyl-8-azoniabicyclo[3.2.1]octan-3-yl) ester;bromide | cid_16195076
TypeSmall organic molecule
Emp. Form.C16H22NO2
Mol. Mass.260.3508
SMILES[H]C12CCC([H])(CC(C1)OC(=O)c1ccccc1)[N+]2(C)C