Reaction Details
TargetDNA dC->dU-editing enzyme APOBEC-3G
LigandBDBM80613
Substrate/Competitorn/a
Meas. Tech.Dose Response confirmation of APOBEC3A DNA Deaminase Inhibitors via a A3G counterscreen
Temperature298.15±n/a K
IC50 7190±563 nM
Commentsextracted
Citation PubChem, PC Dose Response confirmation of APOBEC3A DNA Deaminase Inhibitors via a A3G counterscreen PubChem Bioassay(2011)[AID]
 
DNA dC->dU-editing enzyme APOBEC-3G
Name:DNA dC->dU-editing enzyme APOBEC-3G
Type:Enzyme Catalytic Domain
Mol. Mass.:46419.54
Organism:Homo sapiens (Human)
Description:gi_13399304
Residue:384
BDBM80613
NameBDBM80613
Synonyms:1-(2,3,4-Trimethoxy-benzyl)-piperazine 1-[(2,3,4-trimethoxyphenyl)methyl]piperazine;hydrochloride SMR000674573 cid_9926449
TypeSmall organic molecule
Emp. Form.C14H22N2O3
Mol. Mass.266.3361
SMILESCOc1ccc(CN2CCNCC2)c(OC)c1OC