Reaction Details
TargetDNA dC->dU-editing enzyme APOBEC-3A
LigandBDBM50061567
Substrate/Competitorn/a
Meas. Tech.Dose Response confirmation of small molecule APOBEC3A DNA Deaminase Inhibitors via a fluorescence-based single-stranded DNA deaminase assay
Temperature298.15±n/a K
IC50 1930±n/a nM
Commentsextracted
Citation PubChem, PC Dose Response confirmation of small molecule APOBEC3A DNA Deaminase Inhibitors via a fluorescence-based single-stranded DNA deaminase assay PubChem Bioassay(2011)[AID]
 
DNA dC->dU-editing enzyme APOBEC-3A
Name:DNA dC->dU-editing enzyme APOBEC-3A
Type:Enzyme Catalytic Domain
Mol. Mass.:23013.77
Organism:Homo sapiens (Human)
Description:gi_21955158
Residue:199
BDBM50061567
NameBDBM50061567
Synonyms:1,1-Dimethyl-4-phenyl-piperazin-1-ium CHEMBL47814 cid_5911
TypeSmall organic molecule
Emp. Form.C12H19N2
Mol. Mass.191.2921
SMILESC[N+]1(C)CCN(CC1)c1ccccc1