Reaction Details
TargetDNA dC->dU-editing enzyme APOBEC-3A
LigandBDBM80378
Substrate/Competitorn/a
Meas. Tech.Dose Response confirmation of small molecule APOBEC3A DNA Deaminase Inhibitors via a fluorescence-based single-stranded DNA deaminase assay
Temperature298.15±n/a K
IC50 2030±n/a nM
Commentsextracted
Citation PubChem, PC Dose Response confirmation of small molecule APOBEC3A DNA Deaminase Inhibitors via a fluorescence-based single-stranded DNA deaminase assay PubChem Bioassay(2011)[AID]
 
DNA dC->dU-editing enzyme APOBEC-3A
Name:DNA dC->dU-editing enzyme APOBEC-3A
Type:Enzyme Catalytic Domain
Mol. Mass.:23013.77
Organism:Homo sapiens (Human)
Description:gi_21955158
Residue:199
BDBM80378
NameBDBM80378
Synonyms:3-[(5-benzyl-4-methyl-1,2,4-triazol-3-yl)sulfanyl]-N-phenylpropanamide 3-[(5-benzyl-4-methyl-4H-1,2,4-triazol-3-yl)thio]-N-phenylpropanamide 3-[[4-methyl-5-(phenylmethyl)-1,2,4-triazol-3-yl]thio]-N-phenylpropanamide SMR000082347 | cid_2237442
TypeSmall organic molecule
Emp. Form.C19H20N4OS
Mol. Mass.352.453
SMILESCn1c(Cc2ccccc2)nnc1SCCC(=O)Nc1ccccc1