Reaction Details
TargetDNA dC->dU-editing enzyme APOBEC-3A
LigandBDBM80392
Substrate/Competitorn/a
Meas. Tech.Dose Response confirmation of small molecule APOBEC3A DNA Deaminase Inhibitors via a fluorescence-based single-stranded DNA deaminase assay
Temperature298.15±n/a K
IC50 1610±n/a nM
Commentsextracted
Citation PubChem, PC Dose Response confirmation of small molecule APOBEC3A DNA Deaminase Inhibitors via a fluorescence-based single-stranded DNA deaminase assay PubChem Bioassay(2011)[AID]
 
DNA dC->dU-editing enzyme APOBEC-3A
Name:DNA dC->dU-editing enzyme APOBEC-3A
Type:Enzyme Catalytic Domain
Mol. Mass.:23013.77
Organism:Homo sapiens (Human)
Description:gi_21955158
Residue:199
BDBM80392
NameBDBM80392
Synonyms:1-phenyl-1-cyclopentanecarboxylic acid 3-(4-methyl-4-morpholin-4-iumyl)propyl ester;iodide 3-(4-methylmorpholin-4-ium-4-yl)propyl 1-phenylcyclopentane-1-carboxylate;iodide SMR000129789 | cid_9550057
TypeSmall organic molecule
Emp. Form.C20H30NO3
Mol. Mass.332.4566
SMILESC[N+]1(CCCOC(=O)C2(CCCC2)c2ccccc2)CCOCC1