Reaction Details
TargetDNA dC->dU-editing enzyme APOBEC-3A
LigandBDBM80393
Substrate/Competitorn/a
Meas. Tech.Dose Response confirmation of small molecule APOBEC3A DNA Deaminase Inhibitors via a fluorescence-based single-stranded DNA deaminase assay
Temperature298.15±n/a K
IC50 1060±n/a nM
Commentsextracted
Citation PubChem, PC Dose Response confirmation of small molecule APOBEC3A DNA Deaminase Inhibitors via a fluorescence-based single-stranded DNA deaminase assay PubChem Bioassay(2011)[AID]
 
DNA dC->dU-editing enzyme APOBEC-3A
Name:DNA dC->dU-editing enzyme APOBEC-3A
Type:Enzyme Catalytic Domain
Mol. Mass.:23013.77
Organism:Homo sapiens (Human)
Description:gi_21955158
Residue:199
BDBM80393
NameBDBM80393
Synonyms:MLS000552573 Trimethyl-[2-(1-phenyl-cyclopentanecarbonyloxy)-ethyl]-ammonium trimethyl-[2-(1-phenylcyclopentanecarbonyl)oxyethyl]ammonium;iodide trimethyl-[2-(1-phenylcyclopentyl)carbonyloxyethyl]azanium;iodide | trimethyl-[2-[oxo-(1-phenylcyclopentyl)methoxy]ethyl]ammonium;iodide
TypeSmall organic molecule
Emp. Form.C17H26NO2
Mol. Mass.276.3933
SMILESC[N+](C)(C)CCOC(=O)C1(CCCC1)c1ccccc1