Reaction Details
TargetDNA dC->dU-editing enzyme APOBEC-3A
LigandBDBM54197
Substrate/Competitorn/a
Meas. Tech.Dose Response confirmation of small molecule APOBEC3A DNA Deaminase Inhibitors via a fluorescence-based single-stranded DNA deaminase assay
Temperature298.15±n/a K
IC50 1830±n/a nM
Commentsextracted
Citation PubChem, PC Dose Response confirmation of small molecule APOBEC3A DNA Deaminase Inhibitors via a fluorescence-based single-stranded DNA deaminase assay PubChem Bioassay(2011)[AID]
 
DNA dC->dU-editing enzyme APOBEC-3A
Name:DNA dC->dU-editing enzyme APOBEC-3A
Type:Enzyme Catalytic Domain
Mol. Mass.:23013.77
Organism:Homo sapiens (Human)
Description:gi_21955158
Residue:199
BDBM54197
NameBDBM54197
Synonyms:(1-heptyl-4-pyridylidene)amine;hydroiodide 1-heptyl-4-pyridinimine;hydroiodide MLS000554047 cid_9551797
TypeSmall organic molecule
Emp. Form.C12H20N2
Mol. Mass.192.3006
SMILESCCCCCCCn1ccc(=N)cc1