Reaction Details
TargetDNA dC->dU-editing enzyme APOBEC-3A
LigandBDBM80518
Substrate/Competitorn/a
Meas. Tech.Dose Response confirmation of small molecule APOBEC3A DNA Deaminase Inhibitors via a fluorescence-based single-stranded DNA deaminase assay
Temperature298.15±n/a K
IC50 1310±n/a nM
Commentsextracted
Citation PubChem, PC Dose Response confirmation of small molecule APOBEC3A DNA Deaminase Inhibitors via a fluorescence-based single-stranded DNA deaminase assay PubChem Bioassay(2011)[AID]
 
DNA dC->dU-editing enzyme APOBEC-3A
Name:DNA dC->dU-editing enzyme APOBEC-3A
Type:Enzyme Catalytic Domain
Mol. Mass.:23013.77
Organism:Homo sapiens (Human)
Description:gi_21955158
Residue:199
BDBM80518
NameBDBM80518
Synonyms:Diethyl-methyl-(2,4,6-trimethyl-cyclohex-3-enylmethoxycarbonylmethyl)-ammonium SMR000431412 diethyl-[2-keto-2-[(2,4,6-trimethylcyclohex-3-en-1-yl)methoxy]ethyl]-methyl-ammonium;iodide diethyl-methyl-[2-oxo-2-[(2,4,6-trimethyl-1-cyclohex-3-enyl)methoxy]ethyl]ammonium;iodide | diethyl-methyl-[2-oxo-2-[(2,4,6-trimethylcyclohex-3-en-1-yl)methoxy]ethyl]azanium;iodide
TypeSmall organic molecule
Emp. Form.C17H32NO2
Mol. Mass.282.4409
SMILESCC[N+](C)(CC)CC(=O)OCC1C(C)CC(C)=CC1C