Reaction Details
TargetDNA dC->dU-editing enzyme APOBEC-3A
LigandBDBM80526
Substrate/Competitorn/a
Meas. Tech.Dose Response confirmation of small molecule APOBEC3A DNA Deaminase Inhibitors via a fluorescence-based single-stranded DNA deaminase assay
Temperature298.15±n/a K
IC50 1910±n/a nM
Commentsextracted
Citation PubChem, PC Dose Response confirmation of small molecule APOBEC3A DNA Deaminase Inhibitors via a fluorescence-based single-stranded DNA deaminase assay PubChem Bioassay(2011)[AID]
 
DNA dC->dU-editing enzyme APOBEC-3A
Name:DNA dC->dU-editing enzyme APOBEC-3A
Type:Enzyme Catalytic Domain
Mol. Mass.:23013.77
Organism:Homo sapiens (Human)
Description:gi_21955158
Residue:199
BDBM80526
NameBDBM80526
Synonyms:1-[2-Acetoxy-3-(1,7,7-trimethyl-bicyclo[2.2.1]hept-2-yloxy)-propyl]-1-methyl-piperidinium SMR000440175 [1-(1-methylpiperidin-1-ium-1-yl)-3-[[(1S,4S)-4,7,7-trimethyl-3-bicyclo[2.2.1]heptanyl]oxy]propan-2-yl] ethanoate;iodide acetic acid [1-[(1-methylpiperidin-1-ium-1-yl)methyl]-2-[(1S,4S)-1,7,7-trimethylnorbornan-2-yl]oxy-ethyl] ester;iodide | cid_16682563
TypeSmall organic molecule
Emp. Form.C21H38NO3
Mol. Mass.352.5308
SMILESCC(=O)OC(COC1C[C@@H]2CC[C@@]1(C)C2(C)C)C[N+]1(C)CCCCC1