Reaction Details
TargetDNA dC->dU-editing enzyme APOBEC-3A
LigandBDBM61352
Substrate/Competitorn/a
Meas. Tech.Dose Response confirmation of small molecule APOBEC3A DNA Deaminase Inhibitors via a fluorescence-based single-stranded DNA deaminase assay
Temperature298.15±n/a K
IC50 1550±n/a nM
Commentsextracted
Citation PubChem, PC Dose Response confirmation of small molecule APOBEC3A DNA Deaminase Inhibitors via a fluorescence-based single-stranded DNA deaminase assay PubChem Bioassay(2011)[AID]
 
DNA dC->dU-editing enzyme APOBEC-3A
Name:DNA dC->dU-editing enzyme APOBEC-3A
Type:Enzyme Catalytic Domain
Mol. Mass.:23013.77
Organism:Homo sapiens (Human)
Description:gi_21955158
Residue:199
BDBM61352
NameBDBM61352
Synonyms:5-methyl-6-oxo-3-benzo[b][1,4]benzothiazepinecarboxylic acid ethyl ester MLS001200939 cid_4068244 ethyl 5-methyl-6-oxidanylidene-benzo[b][1,4]benzothiazepine-3-carboxylate | ethyl 5-methyl-6-oxobenzo[b][1,4]benzothiazepine-3-carboxylate
TypeSmall organic molecule
Emp. Form.C17H15NO3S
Mol. Mass.313.371
SMILESCCOC(=O)c1ccc2Sc3ccccc3C(=O)N(C)c2c1