Reaction Details
TargetC-C chemokine receptor type 6
LigandBDBM79992
Substrate/Competitorn/a
Meas. Tech.Dose Response confirmation of small molecule antagonists of the CCR6 receptor: a luminescent beta-arrestin assay
IC50 13900±n/a nM
Citation PubChem, PC Dose Response confirmation of small molecule antagonists of the CCR6 receptor: a luminescent beta-arrestin assay PubChem Bioassay(2011)[AID]
 
C-C chemokine receptor type 6
Name:C-C chemokine receptor type 6
Type:Enzyme
Mol. Mass.:42510.84
Organism:Homo sapiens (Human)
Description:P51684
Residue:374
BDBM79992
NameBDBM79992
Synonyms:(5-chloranylquinolin-8-yl) 4-methyl-3-nitro-benzoate 4-methyl-3-nitro-benzoic acid (5-chloro-8-quinolyl) ester 5-chloro-8-quinolinyl 4-methyl-3-nitrobenzoate SMR000197947 | cid_887191
TypeSmall organic molecule
Emp. Form.C17H11ClN2O4
Mol. Mass.342.733
SMILESCc1ccc(cc1[N+]([O-])=O)C(=O)Oc1ccc(Cl)c2cccnc12