Reaction Details
TargetC-C chemokine receptor type 6
LigandBDBM58116
Substrate/Competitorn/a
Meas. Tech.Dose Response confirmation of small molecule antagonists of the CCR6 receptor: a luminescent beta-arrestin assay
IC50 11700±n/a nM
Citation PubChem, PC Dose Response confirmation of small molecule antagonists of the CCR6 receptor: a luminescent beta-arrestin assay PubChem Bioassay(2011)[AID]
 
C-C chemokine receptor type 6
Name:C-C chemokine receptor type 6
Type:Enzyme
Mol. Mass.:42510.84
Organism:Homo sapiens (Human)
Description:P51684
Residue:374
BDBM58116
NameBDBM58116
Synonyms:Heptanoic acid N'-[1-sec-butyl-4,6-dioxo-2-thioxo-tetrahydro-pyrimidin-(5E)-ylidenemethyl]-hydrazide N'-[(E)-(1-butan-2-yl-4,6-dioxo-2-sulfanylidene-1,3-diazinan-5-ylidene)methyl]heptanehydrazide N'-[(E)-[1-butan-2-yl-4,6-bis(oxidanylidene)-2-sulfanylidene-1,3-diazinan-5-ylidene]methyl]heptanehydrazide cid_6376117
TypeSmall organic molecule
Emp. Form.C16H26N4O3S
Mol. Mass.354.468
SMILESCCCCCCC(=O)NNC=C1C(=O)NC(=S)N(C(C)CC)C1=O