Reaction Details
TargetC-C chemokine receptor type 6
LigandBDBM80075
Substrate/Competitorn/a
Meas. Tech.Dose Response confirmation of small molecule antagonists of the CCR6 receptor: a luminescent beta-arrestin assay
IC50>66600±n/a nM
Citation PubChem, PC Dose Response confirmation of small molecule antagonists of the CCR6 receptor: a luminescent beta-arrestin assay PubChem Bioassay(2011)[AID]
 
C-C chemokine receptor type 6
Name:C-C chemokine receptor type 6
Type:Enzyme
Mol. Mass.:42510.84
Organism:Homo sapiens (Human)
Description:P51684
Residue:374
BDBM80075
NameBDBM80075
Synonyms:7-bromanyl-6-methoxy-quinoline-5,8-dione 7-bromo-6-methoxyquinoline-5,8-dione SMR001570458 | cid_265935
TypeSmall organic molecule
Emp. Form.C10H6BrNO3
Mol. Mass.268.064
SMILESCOC1=C(Br)C(=O)c2ncccc2C1=O