Reaction Details
TargetTropomyosin alpha-1 chain
LigandBDBM50092284
Substrate/Competitorn/a
Meas. Tech.Fluorescence-based biochemical high throughput dose response assay for inhibitors of the calcium sensitivity of cardiac Regulated Thin Filaments (RTF)
IC50 40212±n/a nM
Citation PubChem, PC Fluorescence-based biochemical high throughput dose response assay for inhibitors of the calcium sensitivity of cardiac Regulated Thin Filaments (RTF) PubChem Bioassay(2011)[AID]
 
Tropomyosin alpha-1 chain
Name:Tropomyosin alpha-1 chain
Type:Enzyme Catalytic Domain
Mol. Mass.:32681.01
Organism:Sus scrofa
Description:P42639
Residue:284
BDBM50092284
NameBDBM50092284
Synonyms:5-[(E)-3-(5-Nitro-furan-2-yl)-prop-2-en-(Z)-ylidene]-2-thioxo-thiazolidin-4-one cid_5335985
TypeSmall organic molecule
Emp. Form.C10H6N2O4S2
Mol. Mass.282.296
SMILES[O-][N+](=O)c1ccc(C=CC=C2SC(S)=NC2=O)o1