Reaction Details
TargetTropomyosin alpha-1 chain
LigandBDBM54999
Substrate/Competitorn/a
Meas. Tech.Fluorescence-based biochemical high throughput dose response assay for inhibitors of the calcium sensitivity of cardiac Regulated Thin Filaments (RTF)
IC50 19681±n/a nM
Citation PubChem, PC Fluorescence-based biochemical high throughput dose response assay for inhibitors of the calcium sensitivity of cardiac Regulated Thin Filaments (RTF) PubChem Bioassay(2011)[AID]
 
Tropomyosin alpha-1 chain
Name:Tropomyosin alpha-1 chain
Type:Enzyme Catalytic Domain
Mol. Mass.:32681.01
Organism:Sus scrofa
Description:P42639
Residue:284
BDBM54999
NameBDBM54999
Synonyms:5,6-dihydro-4H-cyclopenta[b]thiophene-2-carboxylic acid [2-[(6-amino-1-benzyl-2,4-diketo-pyrimidin-5-yl)-(2-methoxyethyl)amino]-2-keto-ethyl] ester MLS001080179 [2-[(6-amino-1-benzyl-2,4-dioxopyrimidin-5-yl)-(2-methoxyethyl)amino]-2-oxoethyl] 5,6-dihydro-4H-cyclopenta[b]thiophene-2-carboxylate cid_24979394
TypeSmall organic molecule
Emp. Form.C24H26N4O6S
Mol. Mass.498.551
SMILESCOCCN(C(=O)COC(=O)c1cc2CCCc2s1)c1c(N)n(Cc2ccccc2)c(=O)[nH]c1=O