Reaction Details
TargetTropomyosin alpha-1 chain
LigandBDBM80747
Substrate/Competitorn/a
Meas. Tech.Fluorescence-based biochemical high throughput dose response assay for inhibitors of the calcium sensitivity of cardiac Regulated Thin Filaments (RTF)
IC50 3888±n/a nM
Citation PubChem, PC Fluorescence-based biochemical high throughput dose response assay for inhibitors of the calcium sensitivity of cardiac Regulated Thin Filaments (RTF) PubChem Bioassay(2011)[AID]
 
Tropomyosin alpha-1 chain
Name:Tropomyosin alpha-1 chain
Type:Enzyme Catalytic Domain
Mol. Mass.:32681.01
Organism:Sus scrofa
Description:P42639
Residue:284
BDBM80747
NameBDBM80747
Synonyms:4-oxidanyl-6-phenylazanyl-naphthalene-1-sulfonic acid 6-anilino-4-hydroxy-naphthalene-1-sulfonic acid MLS002637586 cid_219926
TypeSmall organic molecule
Emp. Form.C16H13NO4S
Mol. Mass.315.344
SMILESOc1ccc(c2ccc(Nc3ccccc3)cc12)S(O)(=O)=O