Reaction Details
TargetCysteine protease ATG4B
LigandBDBM43254
Substrate/Competitorn/a
Meas. Tech.Dose response confirmation of the uHTS fluorescent assay for identification of inhibitors of ATG4B.
IC50 1280±n/a nM
Citation PubChem, PC Dose response confirmation of the uHTS fluorescent assay for identification of inhibitors of ATG4B. PubChem Bioassay(2011)[AID]
 
Cysteine protease ATG4B
Name:Cysteine protease ATG4B
Type:Enzyme Catalytic Domain
Mol. Mass.:44279.79
Organism:Homo sapiens (Human)
Description:gi_47132611
Residue:393
BDBM43254
NameBDBM43254
Synonyms:(1Z)-1-[(benzylamino)methylene]-3-nitro-6,7,8,9-tetrahydrodibenzofuran-2-one (1Z)-3-nitro-1-[[(phenylmethyl)amino]methylidene]-6,7,8,9-tetrahydrodibenzofuran-2-one MLS000587848 cid_6348160
TypeSmall organic molecule
Emp. Form.C20H18N2O4
Mol. Mass.350.3679
SMILES[O-][N+](=O)c1cc2oc3CCCCc3c2[c-](\C=[NH+]\Cc2ccccc2)c1=O