Reaction Details
TargetCysteine protease ATG4B
LigandBDBM33131
Substrate/Competitorn/a
Meas. Tech.Dose response confirmation of the uHTS fluorescent assay for identification of inhibitors of ATG4B.
IC50 3170±n/a nM
Citation PubChem, PC Dose response confirmation of the uHTS fluorescent assay for identification of inhibitors of ATG4B. PubChem Bioassay(2011)[AID]
 
Cysteine protease ATG4B
Name:Cysteine protease ATG4B
Type:Enzyme Catalytic Domain
Mol. Mass.:44279.79
Organism:Homo sapiens (Human)
Description:gi_47132611
Residue:393
BDBM33131
NameBDBM33131
Synonyms:MLS000336087 N-[(2-bromophenyl)methylideneamino]-7-chloro-4-quinolinamine SMR000253941 cid_3313154
TypeSmall organic molecule
Emp. Form.C16H11BrClN3
Mol. Mass.360.636
SMILESClc1ccc2c(ccnc2c1)N=NCc1ccccc1Br