Reaction Details
TargetHexokinase-1
LigandBDBM46772
Substrate/Competitorn/a
Meas. Tech.Dose Response confirmation of activators of hexokinase domain containing I (HKDC1) in the hexokinase 1 selectivity assay
EC50>80000±n/a nM
Citation PubChem, PC Dose Response confirmation of activators of hexokinase domain containing I (HKDC1) in the hexokinase 1 selectivity assay PubChem Bioassay(2011)[AID]
 
Hexokinase-1
Name:Hexokinase-1
Type:PROTEIN
Mol. Mass.:102488.34
Organism:Homo sapiens (Human)
Description:EBI_11382
Residue:917
BDBM46772
NameBDBM46772
Synonyms:4-Bromo-N-[N'-(5-methyl-3-phenyl-isoxazole-4-carbonyl)-hydrazinocarbothioyl]-benzamide 4-bromo-N-[[(5-methyl-3-phenyl-1,2-oxazole-4-carbonyl)amino]carbamothioyl]benzamide 4-bromo-N-[[[(5-methyl-3-phenyl-4-isoxazolyl)-oxomethyl]hydrazo]-sulfanylidenemethyl]benzamide SMR000219129 | cid_1884906
TypeSmall organic molecule
Emp. Form.C19H15BrN4O3S
Mol. Mass.459.316
SMILESCc1onc(c1C(=O)NNC(=S)NC(=O)c1ccc(Br)cc1)-c1ccccc1