Reaction Details
TargetHexokinase-1
LigandBDBM33086
Substrate/Competitorn/a
Meas. Tech.Dose Response confirmation of activators of hexokinase domain containing I (HKDC1) in the hexokinase 1 selectivity assay
EC50 41900±n/a nM
Citation PubChem, PC Dose Response confirmation of activators of hexokinase domain containing I (HKDC1) in the hexokinase 1 selectivity assay PubChem Bioassay(2011)[AID]
 
Hexokinase-1
Name:Hexokinase-1
Type:PROTEIN
Mol. Mass.:102488.34
Organism:Homo sapiens (Human)
Description:EBI_11382
Residue:917
BDBM33086
NameBDBM33086
Synonyms:(4-chloro-2,5-dimethoxy-phenyl)-(4-chlorodithiazol-5-ylidene)amine 4-chloro-N-(4-chloro-2,5-dimethoxyphenyl)-5-dithiazolimine MLS000519625 cid_602897
TypeSmall organic molecule
Emp. Form.C10H8Cl2N2O2S2
Mol. Mass.323.219
SMILESCOc1cc(\N=c2\ssnc2Cl)c(OC)cc1Cl