Reaction Details
TargetHexokinase HKDC1 [W721R]
LigandBDBM48030
Substrate/Competitorn/a
Meas. Tech.Dose Response confirmation of inhibitors of hexokinase domain containing I (HKDC1) in the hexokinase 1 selectivity assay
IC50 6020±n/a nM
Citation PubChem, PC Dose Response confirmation of inhibitors of hexokinase domain containing I (HKDC1) in the hexokinase 1 selectivity assay PubChem Bioassay(2011)[AID]
 
Hexokinase HKDC1 [W721R]
Name:Hexokinase HKDC1 [W721R]
Type:Enzyme Catalytic Domain
Mol. Mass.:102520.24
Organism:Homo sapiens (Human)
Description:gi_156151420
Residue:917
BDBM48030
NameBDBM48030
Synonyms:4-[(E)-[3-(2-fluoroanilino)-4-keto-1-naphthylidene]amino]sulfonylbenzoic acid 4-[(E)-[3-(2-fluoroanilino)-4-oxonaphthalen-1-ylidene]amino]sulfonylbenzoic acid MLS000948172 cid_6023694
TypeSmall organic molecule
Emp. Form.C23H15FN2O5S
Mol. Mass.450.439
SMILESOC(=O)c1ccc(cc1)S(=O)(=O)N=C1C=C(Nc2ccccc2F)C(=O)c2ccccc12