Reaction Details
TargetGlucose-6-phosphate dehydrogenase-6-phosphogluconolactonase
LigandBDBM81027
Substrate/Competitorn/a
Meas. Tech.Dose Response confirmation of uHTS small molecule inhibitors of Plasmodium falciparum Glucose-6-phosphate dehydrogenase via a fluorescence intensity assay
IC50 2760±n/a nM
Citation PubChem, PC Dose Response confirmation of uHTS small molecule inhibitors of Plasmodium falciparum Glucose-6-phosphate dehydrogenase via a fluorescence intensity assay PubChem Bioassay(2011)[AID]
 
Glucose-6-phosphate dehydrogenase-6-phosphogluconolactonase
Name:Glucose-6-phosphate dehydrogenase-6-phosphogluconolactonase
Synonyms:n/a
Type:Enzyme Catalytic Domain
Mol. Mass.:109731.64
Organism:Plasmodium falciparum 3D7
Description:gi_12381848
Residue:950
BDBM81027
NameBDBM81027
TypeSmall organic molecule
Emp. Form.C23H22BrNO7
Mol. Mass.504.327
SMILESCCOC(=O)c1c(C)n(-c2ccc(C)cc2)c2c(C(C(C)=O)C(O)=O)c(Br)c(O)c(O)c12