Reaction Details
TargetGlucose-6-phosphate dehydrogenase-6-phosphogluconolactonase
LigandBDBM47776
Substrate/Competitorn/a
Meas. Tech.Dose Response confirmation of uHTS small molecule inhibitors of Plasmodium falciparum Glucose-6-phosphate dehydrogenase via a fluorescence intensity assay
IC50 6750±n/a nM
Citation PubChem, PC Dose Response confirmation of uHTS small molecule inhibitors of Plasmodium falciparum Glucose-6-phosphate dehydrogenase via a fluorescence intensity assay PubChem Bioassay(2011)[AID]
 
Glucose-6-phosphate dehydrogenase-6-phosphogluconolactonase
Name:Glucose-6-phosphate dehydrogenase-6-phosphogluconolactonase
Synonyms:n/a
Type:Enzyme Catalytic Domain
Mol. Mass.:109731.64
Organism:Plasmodium falciparum 3D7
Description:gi_12381848
Residue:950
BDBM47776
NameBDBM47776
TypeSmall organic molecule
Emp. Form.C16H18ClN3O4S
Mol. Mass.383.85
SMILES[O-][N+](=O)c1ccc2c(Cl)c(sc2c1)C(=O)NCCCN1CCOCC1