Reaction Details
TargetGlucose-6-phosphate 1-dehydrogenase
LigandBDBM34408
Substrate/Competitorn/a
Meas. Tech.Human Glucose-6-Phosphate Dehydrogenase Dose Response Selectivity Assay for Inhibitors of Plasmodium falciparum Glucose-6-Phosphate Dehydrogenase
IC50>80000±n/a nM
Citation PubChem, PC Human Glucose-6-Phosphate Dehydrogenase Dose Response Selectivity Assay for Inhibitors of Plasmodium falciparum Glucose-6-Phosphate Dehydrogenase PubChem Bioassay(2011)[AID]
 
Glucose-6-phosphate 1-dehydrogenase
Name:Glucose-6-phosphate 1-dehydrogenase
Type:Enzyme
Mol. Mass.:59258.58
Organism:Homo sapiens (Human)
Description:P11413
Residue:515
BDBM34408
NameBDBM34408
Synonyms:4-amino-3-(4-methylphenyl)-5-[(4-methyl-1-piperazinyl)carbonyl]-1,3-thiazole-2(3H)-thione SMR000072496 [4-amino-3-(4-methylphenyl)-2-sulfanylidene-5-thiazolyl]-(4-methyl-1-piperazinyl)methanone [4-azanyl-3-(4-methylphenyl)-2-sulfanylidene-1,3-thiazol-5-yl]-(4-methylpiperazin-1-yl)methanone | cid_889983
TypeSmall organic molecule
Emp. Form.C16H20N4OS2
Mol. Mass.348.486
SMILESCN1CCN(CC1)C(=O)c1sc(=S)n(c1N)-c1ccc(C)cc1