Reaction Details
TargetcAMP-dependent protein kinase type II-beta regulatory subunit
LigandBDBM81295
Substrate/Competitorn/a
Meas. Tech.Fluorescence polarization-based biochemical high throughput dose response assay for activators of the Protein Kinase A-R2B (PKA-R2B) complex
EC50 68984±n/a nM
Citation PubChem, PC Fluorescence polarization-based biochemical high throughput dose response assay for activators of the Protein Kinase A-R2B (PKA-R2B) complex PubChem Bioassay(2011)[AID]
 
cAMP-dependent protein kinase type II-beta regulatory subunit
Name:cAMP-dependent protein kinase type II-beta regulatory subunit
Type:PROTEIN
Mol. Mass.:46282.41
Organism:Homo sapiens (Human)
Description:EBI_11972
Residue:418
BDBM81295
NameBDBM81295
Synonyms:4-{(E)-[4-(dimethylamino)-1-naphthyl]diazenyl}benzenesulfonate SMR000304438 sodium;4-[[4-(dimethylamino)-1-naphthalenyl]azo]benzenesulfonate sodium;4-[[4-(dimethylamino)naphthalen-1-yl]diazenyl]benzenesulfonate
TypeSmall organic molecule
Emp. Form.C18H16N3O3S
Mol. Mass.354.403
SMILESCN(C)c1ccc(\N=N\c2ccc(cc2)S([O-])(=O)=O)c2ccccc12