Reaction Details
TargetcAMP-dependent protein kinase type II-beta regulatory subunit
LigandBDBM51788
Substrate/Competitorn/a
Meas. Tech.Fluorescence polarization-based biochemical high throughput dose response assay for activators of the Protein Kinase A-R2B (PKA-R2B) complex
EC50>113704±n/a nM
Citation PubChem, PC Fluorescence polarization-based biochemical high throughput dose response assay for activators of the Protein Kinase A-R2B (PKA-R2B) complex PubChem Bioassay(2011)[AID]
 
cAMP-dependent protein kinase type II-beta regulatory subunit
Name:cAMP-dependent protein kinase type II-beta regulatory subunit
Type:PROTEIN
Mol. Mass.:46282.41
Organism:Homo sapiens (Human)
Description:EBI_11972
Residue:418
BDBM51788
NameBDBM51788
Synonyms:5-[(2E)-2-(8-oxidanylidenequinolin-5-ylidene)hydrazinyl]naphthalene-1-sulfonic acid 5-[(2E)-2-(8-oxoquinolin-5-ylidene)hydrazinyl]naphthalene-1-sulfonic acid 5-[(N'E)-N'-(8-keto-5-quinolylidene)hydrazino]naphthalene-1-sulfonic acid SMR000555383 | cid_5876309
TypeSmall organic molecule
Emp. Form.C19H13N3O4S
Mol. Mass.379.389
SMILESOc1ccc(N=Nc2cccc3c(cccc23)S(O)(=O)=O)c2cccnc12