Reaction Details
TargetcAMP-dependent protein kinase type II-beta regulatory subunit
LigandBDBM66980
Substrate/Competitorn/a
Meas. Tech.Counterscreen for activators of the Protein Kinase A-R1A (PKA-R1A) complex
EC50 9102±n/a nM
Citation PubChem, PC Counterscreen for activators of the Protein Kinase A-R1A (PKA-R1A) complex: fluorescence polarization-based biochemical high throughput dose response assay to identify activators of the Protein Kinase A-R2B (PKA-R2B) complex PubChem Bioassay(2011)[AID]
 
cAMP-dependent protein kinase type II-beta regulatory subunit
Name:cAMP-dependent protein kinase type II-beta regulatory subunit
Type:PROTEIN
Mol. Mass.:46282.41
Organism:Homo sapiens (Human)
Description:EBI_11972
Residue:418
BDBM66980
NameBDBM66980
Synonyms:Bucladesine sodium salt SMR001233340 sodium;[(4aS,5R,6R,7aR)-6-[6-(butanoylamino)purin-9-yl]-2-oxidanidyl-2-oxidanylidene-4a,5,6,7a-tetrahydro-4H-furo[2,3-d][1,3,2]dioxaphosphinin-5-yl] butanoate;hydrate sodium;butanoic acid [(4aS,5R,6R,7aR)-2-oxido-2-oxo-6-[6-(1-oxobutylamino)-9-purinyl]-4a,5,6,7a-tetrahydro-4H-furo[2,3-d][1,3,2]dioxaphosphorin-5-yl] ester;hydrate | sodium;butyric acid [(4aS,5R,6R,7aR)-6-(6-butyramidopurin-9-yl)-2-keto-2-oxido-4a,5,6,7a-tetrahydro-4H-furo[2,3-d][1,3,2]dioxaphosphorin-5-yl] ester;hydrate
TypeSmall organic molecule
Emp. Form.C18H23N5O8P
Mol. Mass.468.3782
SMILESCCCC(=O)Nc1ncnc2n(cnc12)[C@@H]1O[C@@H]2OP([O-])(=O)OC[C@H]2[C@H]1OC(=O)CCC