Reaction Details
TargetLanosterol 14-alpha-demethylase
LigandBDBM81298
Substrate/Competitorn/a
Meas. Tech.Inhibition Assay
pH6±0
Kd 1.0e+2±n/a nM
Citation Lepesheva, GIOtt, RDHargrove, TYKleshchenko, YYSchuster, INes, WDHill, GCVillalta, FWaterman, MR Sterol 14alpha-demethylase as a potential target for antitrypanosomal therapy: enzyme inhibition and parasite cell growth. Chem Biol14:1283-93 (2007) 
 
Lanosterol 14-alpha-demethylase
Name:Lanosterol 14-alpha-demethylase
Type:Protein
Mol. Mass.:54377.77
Organism:Trypanosoma brucei
Description:Q385E8
Residue:481
BDBM81298
NameBDBM81298
Synonyms:Azole, 2
TypeSmall organic molecule
Emp. Form.C20H16Cl2N5O2
Mol. Mass.429.279
SMILESClc1ccc(C(C[NH+]2C=CN=C2)NC(=O)c2nnc(o2)-c2ccccc2)c(Cl)c1