Reaction Details
TargetSterol 14-alpha demethylase
LigandBDBM81299
Substrate/Competitorn/a
Meas. Tech.Inhibition Assay
pH6±0
Kd 7e+1±n/a nM
Citation Lepesheva, GIOtt, RDHargrove, TYKleshchenko, YYSchuster, INes, WDHill, GCVillalta, FWaterman, MR Sterol 14alpha-demethylase as a potential target for antitrypanosomal therapy: enzyme inhibition and parasite cell growth. Chem Biol14:1283-93 (2007) 
 
Sterol 14-alpha demethylase
Name:Sterol 14-alpha demethylase
Type:Protein
Mol. Mass.:54690.12
Organism:Trypanosoma cruzi
Description:Q7Z1V1
Residue:481
BDBM81299
NameBDBM81299
Synonyms:Azole, 4
TypeSmall organic molecule
Emp. Form.C24H20ClN3O
Mol. Mass.401.888
SMILESClc1ccc(cc1)-c1ccc(cc1)C(=O)NC(Cn1ccnc1)c1ccccc1