Reaction Details
TargetSterol 14-alpha demethylase
LigandBDBM81303
Substrate/Competitorn/a
Meas. Tech.Inhibition Assay
pH6±0
Kd 1.1e+2±n/a nM
Citation Lepesheva, GIOtt, RDHargrove, TYKleshchenko, YYSchuster, INes, WDHill, GCVillalta, FWaterman, MR Sterol 14alpha-demethylase as a potential target for antitrypanosomal therapy: enzyme inhibition and parasite cell growth. Chem Biol14:1283-93 (2007) 
 
Sterol 14-alpha demethylase
Name:Sterol 14-alpha demethylase
Type:Protein
Mol. Mass.:54690.12
Organism:Trypanosoma cruzi
Description:Q7Z1V1
Residue:481
BDBM81303
NameBDBM81303
Synonyms:Azole, 8
TypeSmall organic molecule
Emp. Form.C22H18ClN3OS
Mol. Mass.407.916
SMILESClc1ccc(cc1)-c1cc(cs1)C(=O)NCC(c1ccccc1)n1ccnc1