Reaction Details
TargetPutative farnesyl pyrophosphate synthase
LigandBDBM12578
Substrate/Competitorn/a
Meas. Tech.Enzymatic Assay
pH7.7±0
Temperature310.15±0 K
Ki 0.050±0.038 nM
IC50 30.1±1.1 nM
Citation Artz, JDDunford, JEArrowood, MJDong, AChruszcz, MKavanagh, KLMinor, WRussell, RGEbetino, FHOppermann, UHui, R Targeting a uniquely nonspecific prenyl synthase with bisphosphonates to combat cryptosporidiosis. Chem Biol15:1296-306 (2008) 
 
Putative farnesyl pyrophosphate synthase
Name:Putative farnesyl pyrophosphate synthase
Synonyms:n/a
Type:Enzyme
Mol. Mass.:44960.82
Organism:Cryptosporidium parvum
Description:Belongs to the FPP/GGPP synthase family. Q5CR09
Residue:384
BDBM12578
NameBDBM12578
TypeSmall organic molecule
Emp. Form.C5H10N2O7P2
Mol. Mass.272.0896
SMILESOC(Cn1ccnc1)(P(O)(O)=O)P(O)(O)=O