Reaction Details
TargetNicotinate-nucleotide adenylyltransferase
LigandBDBM50318653
Substrate/Competitorn/a
Meas. Tech.Enzymatic Inhibition Assay
Ki 2.5e+4± 9e+3 nM
IC50 6.5e+4±n/a nM
Citation Sorci, LPan, YEyobo, YRodionova, IHuang, NKurnasov, OZhong, SMacKerell, ADZhang, HOsterman, AL Targeting NAD biosynthesis in bacterial pathogens: Structure-based development of inhibitors of nicotinate mononucleotide adenylyltransferase NadD. Chem Biol16:849-61 (2009) 
 
Nicotinate-nucleotide adenylyltransferase
Name:Nicotinate-nucleotide adenylyltransferase
Type:Enzyme
Mol. Mass.:24523.61
Organism:Escherichia coli
Description:P0A752
Residue:213
BDBM50318653
NameBDBM50318653
Synonyms:3-amino-N-(3-fluorophenyl)-6-(thiophen-2-yl)thieno[2,3-b]pyridine-2-carboxamide CHEMBL1084955 US8785499, 3_02
TypeSmall organic molecule
Emp. Form.C18H12FN3OS2
Mol. Mass.369.436
SMILESNc1c(sc2nc(ccc12)-c1cccs1)C(=O)Nc1cccc(F)c1