Reaction Details
TargetTyrosine-protein kinase HCK
LigandBDBM81374
Substrate/Competitorn/a
Meas. Tech.In Vitro Activity Assay
pH7.5±0
Kd 8.7±0.6 nM
Citation Ranjitkar, PBrock, AMMaly, DJ Affinity reagents that target a specific inactive form of protein kinases. Chem Biol17:195-206 (2010) 
 
Tyrosine-protein kinase HCK
Name:Tyrosine-protein kinase HCK
Type:Enzyme Catalytic Domain
Mol. Mass.:59600.18
Organism:Homo sapiens (Human)
Description:P08631
Residue:526
BDBM81374
NameBDBM81374
Synonyms:BODIPY-labeled probe, 4a
TypeSmall organic molecule
Emp. Form.C50H49BF4N11O4
Mol. Mass.954.799
SMILESCc1cc(C)n2B(F)[N+]3=C(CCC(=O)NCCCCC(=O)NCCOc4ccc(Nc5ncnc(n5)-c5cccnc5Nc5cc(NC(=O)c6cccc(c6)C(F)(F)F)ccc5C)cc4)C=CC3=Cc12