Reaction Details
TargetTyrosine-protein kinase ABL1
LigandBDBM81376
Substrate/Competitorn/a
Meas. Tech.In Vitro Activity Assay
pH7.5±0
IC50 6.6±1.0 nM
Citation Ranjitkar, PBrock, AMMaly, DJ Affinity reagents that target a specific inactive form of protein kinases. Chem Biol17:195-206 (2010) 
 
Tyrosine-protein kinase ABL1
Name:Tyrosine-protein kinase ABL1
Type:Enzyme
Mol. Mass.:122897.30
Organism:Homo sapiens (Human)
Description:P00519
Residue:1130
BDBM81376
NameBDBM81376
Synonyms:Amine compound, 13a
TypeSmall organic molecule
Emp. Form.C42H47F3N8O7
Mol. Mass.832.8672
SMILESCc1ccc(NC(=O)c2cccc(c2)C(F)(F)F)cc1Nc1ncccc1-c1cc(Nc2ccc(OCCNC(=O)COCCOCCOCCOCCN)cc2)ncn1