Reaction Details
TargetPlatelet-derived growth factor receptor beta
LigandBDBM81378
Substrate/Competitorn/a
Meas. Tech.In Vitro Activity Kinase Assay
Kd 480±0.0 nM
Citation Zhou, WHur, WMcDermott, UDutt, AXian, WFicarro, SBZhang, JSharma, SVBrugge, JMeyerson, MSettleman, JGray, NS A structure-guided approach to creating covalent FGFR inhibitors. Chem Biol17:285-95 (2010) 
 
Platelet-derived growth factor receptor beta
Name:Platelet-derived growth factor receptor beta
Type:Enzyme
Mol. Mass.:123922.25
Organism:Homo sapiens (Human)
Description:P09619
Residue:1106
BDBM81378
NameBDBM81378
Synonyms:FRIN-1
TypeSmall organic molecule
Emp. Form.C30H37Cl2N7O4
Mol. Mass.630.565
SMILESCCNCCCCNc1ncc2CN(C(=O)N(Cc3cccc(NC(=O)CC)c3)c2n1)c1c(Cl)c(OC)cc(OC)c1Cl