Reaction Details
TargetHypoxia-inducible factor 1-alpha
LigandBDBM81380
Substrate/Competitorn/a
Meas. Tech.Enzyme Inhibition Assay
IC50 1.0e+4± 1e+3 nM
Citation Smirnova, NARakhman, IMoroz, NBasso, MPayappilly, JKazakov, SHernandez-Guzman, FGaisina, INKozikowski, APRatan, RRGazaryan, IG Utilization of an in vivo reporter for high throughput identification of branched small molecule regulators of hypoxic adaptation. Chem Biol17:380-91 (2010) 
 
Hypoxia-inducible factor 1-alpha
Name:Hypoxia-inducible factor 1-alpha
Type:Protein
Mol. Mass.:92647.24
Organism:Homo sapiens (Human)
Description:Q16665
Residue:826
BDBM81380
NameBDBM81380
Synonyms:Oxyquinoline, D1, #10
TypeSmall organic molecule
Emp. Form.C20H21N3O
Mol. Mass.319.4002
SMILESOc1c(ccc2cccnc12)C(N1CCCCC1)c1ccncc1