Reaction Details
TargetHypoxia-inducible factor 1-alpha
LigandBDBM81386
Substrate/Competitorn/a
Meas. Tech.Enzyme Inhibition Assay
IC50 1.2e+4± 1e+3 nM
Citation Smirnova, NARakhman, IMoroz, NBasso, MPayappilly, JKazakov, SHernandez-Guzman, FGaisina, INKozikowski, APRatan, RRGazaryan, IG Utilization of an in vivo reporter for high throughput identification of branched small molecule regulators of hypoxic adaptation. Chem Biol17:380-91 (2010) 
 
Hypoxia-inducible factor 1-alpha
Name:Hypoxia-inducible factor 1-alpha
Type:Protein
Mol. Mass.:92647.24
Organism:Homo sapiens (Human)
Description:Q16665
Residue:826
BDBM81386
NameBDBM81386
Synonyms:Oxyquinoline, D2, #2
TypeSmall organic molecule
Emp. Form.C24H21N3O3
Mol. Mass.399.4418
SMILESCc1cccc(NC(c2ccc3OCOc3c2)c2ccc3ccc(C)nc3c2O)n1