Reaction Details
TargetHypoxia-inducible factor 1-alpha
LigandBDBM81387
Substrate/Competitorn/a
Meas. Tech.Enzyme Inhibition Assay
IC50 2.6e+3± 2e+2 nM
Citation Smirnova, NARakhman, IMoroz, NBasso, MPayappilly, JKazakov, SHernandez-Guzman, FGaisina, INKozikowski, APRatan, RRGazaryan, IG Utilization of an in vivo reporter for high throughput identification of branched small molecule regulators of hypoxic adaptation. Chem Biol17:380-91 (2010) 
 
Hypoxia-inducible factor 1-alpha
Name:Hypoxia-inducible factor 1-alpha
Type:Protein
Mol. Mass.:92647.24
Organism:Homo sapiens (Human)
Description:Q16665
Residue:826
BDBM81387
NameBDBM81387
Synonyms:Oxyquinoline, D3, #1 | cid_3129250
TypeSmall organic molecule
Emp. Form.C23H26N2O4
Mol. Mass.394.4635
SMILESCCCCC(=O)NC(c1ccc(OC)c(OC)c1)c1ccc2cccnc2c1O