Reaction Details
TargetDipeptidyl peptidase 1
LigandBDBM81397
Substrate/Competitorn/a
Meas. Tech.Fluorogenic Assay
IC50 700±0.0 nM
Citation Deu, ELeyva, MJAlbrow, VERice, MJEllman, JABogyo, M Functional studies of Plasmodium falciparum dipeptidyl aminopeptidase I using small molecule inhibitors and active site probes. Chem Biol17:808-19 (2010) 
 
Dipeptidyl peptidase 1
Name:Dipeptidyl peptidase 1
Type:PROTEIN
Mol. Mass.:52379.83
Organism:Mus musculus
Description:ChEMBL_44964
Residue:462
BDBM81397
NameBDBM81397
Synonyms:ML4057
TypeSmall organic molecule
Emp. Form.C17H20F4N4O2
Mol. Mass.388.3599
SMILESCCCCC(C(=O)COc1c(F)c(F)cc(F)c1F)n1cc(nn1)C(C)N