Reaction Details
TargetInosine-5'-monophosphate dehydrogenase
LigandBDBM81422
Substrate/Competitorn/a
Meas. Tech.Inhibition Assay
pH8±0
Temperature298.15±0 K
IC50 8.5e+4±n/a nM
Citation Gollapalli, DRMacpherson, ISLiechti, GGorla, SKGoldberg, JBHedstrom, L Structural determinants of inhibitor selectivity in prokaryotic IMP dehydrogenases. Chem Biol17:1084-91 (2010) 
 
Inosine-5'-monophosphate dehydrogenase
Name:Inosine-5'-monophosphate dehydrogenase
Type:Protein
Mol. Mass.:52801.05
Organism:Streptococcus pyogenes
Description:P0C0H6
Residue:493
BDBM81422
NameBDBM81422
Synonyms:N-(4-methoxyphenyl)-2-(naphthalen-1-yl)acetamide, Compound B
TypeSmall organic molecule
Emp. Form.C19H17NO2
Mol. Mass.291.3438
SMILESCOc1ccc(NC(=O)Cc2cccc3ccccc23)cc1