Reaction Details
TargetInosine-5'-monophosphate dehydrogenase
LigandBDBM81426
Substrate/Competitorn/a
Meas. Tech.Inhibition Assay
pH8±0
Temperature298.15±0 K
IC50 5.5e+2±n/a nM
Citation Gollapalli, DRMacpherson, ISLiechti, GGorla, SKGoldberg, JBHedstrom, L Structural determinants of inhibitor selectivity in prokaryotic IMP dehydrogenases. Chem Biol17:1084-91 (2010) 
 
Inosine-5'-monophosphate dehydrogenase
Name:Inosine-5'-monophosphate dehydrogenase
Type:Protein
Mol. Mass.:52801.05
Organism:Streptococcus pyogenes
Description:P0C0H6
Residue:493
BDBM81426
NameBDBM81426
Synonyms:1H-naphtho[2,3-d]imidazol-2-ylmethyl 4-aminobenzoate, Compound G
TypeSmall organic molecule
Emp. Form.C19H15N3O2
Mol. Mass.317.3413
SMILESNc1ccc(cc1)C(=O)OCc1nc2cc3ccccc3cc2[nH]1