Reaction Details
TargetCyclin-dependent kinase 1
LigandBDBM81435
Substrate/Competitorn/a
Meas. Tech.In Vitro Kinase Assay
Ki 660±353 nM
Citation Wang, SGriffiths, GMidgley, CABarnett, ALCooper, MGrabarek, JIngram, LJackson, WKontopidis, GMcClue, SJMcInnes, CMcLachlan, JMeades, CMezna, MStuart, IThomas, MPZheleva, DILane, DPJackson, RCGlover, DMBlake, DGFischer, PM Discovery and characterization of 2-anilino-4- (thiazol-5-yl)pyrimidine transcriptional CDK inhibitors as anticancer agents. Chem Biol17:1111-21 (2010) 
 
Cyclin-dependent kinase 1
Name:Cyclin-dependent kinase 1
Type:Enzyme Subunit
Mol. Mass.:34101.08
Organism:Homo sapiens (Human)
Description:P06493
Residue:297
BDBM81435
NameBDBM81435
Synonyms:CDK Inhibitor, 8
TypeSmall organic molecule
Emp. Form.C16H18N6O2S2
Mol. Mass.390.483
SMILESCCNS(=O)(=O)c1cccc(Nc2nccc(n2)-c2sc(N)nc2C)c1