Reaction Details
TargetCyclin-dependent kinase 1
LigandBDBM81438
Substrate/Competitorn/a
Meas. Tech.In Vitro Kinase Assay
Ki 4.1±0.8 nM
Citation Wang, SGriffiths, GMidgley, CABarnett, ALCooper, MGrabarek, JIngram, LJackson, WKontopidis, GMcClue, SJMcInnes, CMcLachlan, JMeades, CMezna, MStuart, IThomas, MPZheleva, DILane, DPJackson, RCGlover, DMBlake, DGFischer, PM Discovery and characterization of 2-anilino-4- (thiazol-5-yl)pyrimidine transcriptional CDK inhibitors as anticancer agents. Chem Biol17:1111-21 (2010) 
 
Cyclin-dependent kinase 1
Name:Cyclin-dependent kinase 1
Type:Enzyme Subunit
Mol. Mass.:34101.08
Organism:Homo sapiens (Human)
Description:P06493
Residue:297
BDBM81438
NameBDBM81438
Synonyms:CDK Inhibitor, 11
TypeSmall organic molecule
Emp. Form.C18H21N5O4S2
Mol. Mass.435.52
SMILESCOCCNS(=O)(=O)c1ccc(Nc2nccc(n2)-c2sc(=O)n(C)c2C)cc1