Reaction Details
TargetTyrosine-protein kinase JAK1
LigandBDBM26198
Substrate/Competitorn/a
Meas. Tech.Enzyme Assay
pH7.5±0
Temperature303.15±0 K
IC50 5.2±0.4 nM
Citation Haan, CRolvering, CRaulf, FKapp, MDrückes, PThoma, GBehrmann, IZerwes, HG Jak1 has a dominant role over Jak3 in signal transduction through γc-containing cytokine receptors. Chem Biol18:314-23 (2011) 
 
Tyrosine-protein kinase JAK1
Name:Tyrosine-protein kinase JAK1
Type:Protein
Mol. Mass.:133293.73
Organism:Homo sapiens (Human)
Description:P23458
Residue:1154
BDBM26198
NameBDBM26198
Synonyms:4-tert-butyl-15-fluoro-3,5,10-triazatetracyclo[11.4.0.0^{2,6}.0^{7,12}]heptadeca-1(13),2(6),3,7(12),8,14,16-heptaen-11-one Compound # 2 PDK1 inhibitor, 1 | Tetracyclic Pyridone, 1
TypeSmall organic molecule
Emp. Form.C18H16FN3O
Mol. Mass.309.3375
SMILESCC(C)(C)c1nc2c([nH]1)c1ccc(F)cc1c1c2cc[nH]c1=O