Reaction Details
Target5-hydroxytryptamine receptor 7
LigandBDBM30709
Substrate/Competitorn/a
Ki 14±n/a nM
CommentsPDSP_2787
Citation Greenberg, DAPrichard, DCSnyder, SH Alpha-noradrenergic receptor binding in mammalian brain: differential labeling of agonist and antagonist states. Life Sci19:69-76 (1976) 
 
5-hydroxytryptamine receptor 7
Name:5-hydroxytryptamine receptor 7
Type:G Protein-Coupled Receptor (GPCR)
Mol. Mass.:49852.62
Organism:Rattus norvegicus (rat)
Description:Rat cloned 5-HT7R.
Residue:448
BDBM30709
NameBDBM30709
Synonyms:ERGOCORNINE SMR000058938 | cid_73453
TypeSmall organic molecule
Emp. Form.C31H39N5O5
Mol. Mass.561.6719
SMILES[H][C@@]12CCCN1C(=O)[C@H](C(C)C)N1C(=O)[C@](NC(=O)[C@H]3CN(C)[C@]4([H])Cc5c[nH]c6cccc(C4=C3)c56)(O[C@@]21O)C(C)C