Reaction Details
Target5-hydroxytryptamine receptor 7
LigandBDBM50001922
Substrate/Competitorn/a
Ki 6.1±n/a nM
CommentsPDSP_1290
Citation Greenberg, DAPrichard, DCSnyder, SH Alpha-noradrenergic receptor binding in mammalian brain: differential labeling of agonist and antagonist states. Life Sci19:69-76 (1976) 
 
5-hydroxytryptamine receptor 7
Name:5-hydroxytryptamine receptor 7
Type:G Protein-Coupled Receptor (GPCR)
Mol. Mass.:49852.62
Organism:Rattus norvegicus (rat)
Description:Rat cloned 5-HT7R.
Residue:448
BDBM50001922
NameBDBM50001922
Synonyms:2-Naphthalen-1-ylmethyl-4,5-dihydro-1H-imidazole; hydrochloride CHEMBL1706 Nafazair Naphazoline Nitrate Opcon cid_11079
TypeSmall organic molecule
Emp. Form.C14H14N2
Mol. Mass.210.2744
SMILESC(C1=NCCN1)c1cccc2ccccc12